Target
Melanin-concentrating hormone receptor 1
Ligand
BDBM50162113
Substrate
Meas. Tech.
ChEMBL_306651 (CHEMBL832988)
IC50
1985±n/a nM
Citation
 Souers, AJGao, JBrune, MBush, EWodka, DVasudevan, AJudd, ASMulhern, MBrodjian, SDayton, BShapiro, RHernandez, LEMarsh, KCSham, HLCollins, CAKym, PR Identification of 2-(4-benzyloxyphenyl)-N- [1-(2-pyrrolidin-1-yl-ethyl)-1H-indazol-6-yl]acetamide, an orally efficacious melanin-concentrating hormone receptor 1 antagonist for the treatment of obesity. J Med Chem 48:1318-21 (2005)  
Target
Name:
Melanin-concentrating hormone receptor 1
Synonyms:
G-protein coupled receptor 24 MCH receptor 1 MCH-R1 MCHR-1 MCHR1_HUMAN Melanin-Concentrating Hormone Receptor 1 (MCH1R) Melanin-concentrating hormone receptor 1 (MCH-1) Melanin-concentrating hormone receptor 1 (MCHR-1) SLC-1 Somatostatin receptor-like protein
Type:
G Protein-Coupled Receptor (GPCR)
Mol. Mass.:
45976.27
Organism:
Homo sapiens (Human)
Description:
Membranes from CHO-K1 cells stably expressing human MCH1R were used in assays.
Residue:
422
  
Inhibitor
Name:
BDBM50162113
Synonyms:
2-(4-Benzyloxy-phenyl)-N-[1-(2-pyrrolidin-1-yl-ethyl)-2H-indazol-5-yl]-acetamide | CHEMBL179606
Type:
Small organic molecule
Emp. Form.:
C28H30N4O2
Mol. Mass.:
454.5634
SMILES:
O=C(Cc1ccc(OCc2ccccc2)cc1)Nc1ccc2nn(CCN3CCCC3)cc2c1
: