Target
Tyrosine-protein phosphatase non-receptor type 6
Ligand
BDBM50162440
Substrate
Meas. Tech.
ChEMBL_304153 (CHEMBL828133)
EC50
160000±n/a nM
Citation
 Imhof, DWieligmann, KHampel, KNothmann, DZoda, MSSchmidt-Arras, DZacharias, MBöhmer, FDReissmann, S Design and biological evaluation of linear and cyclic phosphopeptide ligands of the N-terminal SH2 domain of protein tyrosine phosphatase SHP-1. J Med Chem 48:1528-39 (2005)  
Target
Name:
Tyrosine-protein phosphatase non-receptor type 6
Synonyms:
HCP PTP1C Protein tyrosine phosphatase SHP-1 (SHP-1) Protein-tyrosine phosphatase SHP-1 Tyrosine-protein phosphatase non-receptor type 6 | Tyrosine-protein phosphatase non-receptor type 6 (SHP1)
Type:
Protein
Mol. Mass.:
67570.41
Organism:
Homo sapiens (Human)
Description:
P29350
Residue:
595
  
Inhibitor
Name:
BDBM50162440
Synonyms:
CHEMBL371014 | H-Glu-Gly-Leu-Asn-pTyr-Met-Val-Leu-NH2
Type:
Small organic molecule
Emp. Form.:
C42H68N9O16PS
Mol. Mass.:
1018.079
SMILES:
CSCC[C@H](NC(=O)[C@@H](NC(=O)[C@@H](N)CC(C)C)C(C)C)C(=O)N[C@@H](Cc1ccc(OP(O)(O)=O)cc1)C(=O)N[C@@H](CC(N)=O)C(=O)N[C@@H](CC(C)C)C(=O)NCC(=O)N[C@@H](CCC(O)=O)C(O)=O
: