Target
Tyrosine-protein phosphatase non-receptor type 6
Ligand
BDBM50162447
Substrate
Meas. Tech.
ChEMBL_304153 (CHEMBL828133)
EC50
180000±n/a nM
Citation
 Imhof, DWieligmann, KHampel, KNothmann, DZoda, MSSchmidt-Arras, DZacharias, MBöhmer, FDReissmann, S Design and biological evaluation of linear and cyclic phosphopeptide ligands of the N-terminal SH2 domain of protein tyrosine phosphatase SHP-1. J Med Chem 48:1528-39 (2005)  
Target
Name:
Tyrosine-protein phosphatase non-receptor type 6
Synonyms:
HCP PTP1C Protein tyrosine phosphatase SHP-1 (SHP-1) Protein-tyrosine phosphatase SHP-1 Tyrosine-protein phosphatase non-receptor type 6 | Tyrosine-protein phosphatase non-receptor type 6 (SHP1)
Type:
Protein
Mol. Mass.:
67570.41
Organism:
Homo sapiens (Human)
Description:
P29350
Residue:
595
  
Inhibitor
Name:
BDBM50162447
Synonyms:
CHEMBL412918 | H-Glu-Gly-Leu-Asn-pTyr-Met-Val-Abu(betaPh)-NH2
Type:
Small organic molecule
Emp. Form.:
C46H68N9O16PS
Mol. Mass.:
1066.122
SMILES:
CSCC[C@@H](NC(=O)[C@@H](NC(=O)[C@H](N)C(C)c1ccccc1)C(C)C)C(=O)N[C@@H](Cc1ccc(OP(O)(O)=O)cc1)C(=O)N[C@@H](CC(N)=O)C(=O)N[C@@H](CC(C)C)C(=O)NCC(=O)N[C@@H](CCC(O)=O)C(O)=O
: