Target
Acetylcholinesterase
Ligand
BDBM50590549
Substrate
Meas. Tech.
ChEMBL_2197058 (CHEMBL5109574)
IC50
5600±n/a nM
Citation
 Macedo Vaz, Sde Freitas Silva, MDos Reis Rosa Franco, GJorge R Guimarães, MMotta R da Silva, FGonçalves Castro, NAlvim Guedes, IDardenne, LEAmaral Alves, MGarrett da Costa, RBeserra Pinheiro, GGermino Veras, LRenata Mortari, MPruccoli, LTarozzi, AViegas, C Synthesis and biological evaluation of 4-hydroxy-methylpiperidinyl-N-benzyl-acylarylhydrazone hybrids designed as novel multifunctional drug candidates for Alzheimer's disease. Bioorg Med Chem 71:0 (2022) Target
Name:
Acetylcholinesterase
Synonyms:
ACES_ELEEL Acetylcholinesterase (EeAChE) | ache
Type:
Enzyme
Mol. Mass.:
71812.79
Organism:
Electrophorus electricus (Electric eel)
Description:
Residue:
633
  
Inhibitor
Name:
BDBM50590549
Synonyms:
CHEMBL5175519
Type:
Small organic molecule
Emp. Form.:
C21H24ClN3O2
Mol. Mass.:
385.887
SMILES:
OCC1CCN(Cc2ccc(cc2)C(=O)N\N=C\c2ccc(Cl)cc2)CC1
: