Target
Cholinesterase
Ligand
BDBM8960
Substrate
Meas. Tech.
ChEMBL_2197059 (CHEMBL5109575)
IC50
4700±n/a nM
Citation
 Macedo Vaz, Sde Freitas Silva, MDos Reis Rosa Franco, GJorge R Guimarães, MMotta R da Silva, FGonçalves Castro, NAlvim Guedes, IDardenne, LEAmaral Alves, MGarrett da Costa, RBeserra Pinheiro, GGermino Veras, LRenata Mortari, MPruccoli, LTarozzi, AViegas, C Synthesis and biological evaluation of 4-hydroxy-methylpiperidinyl-N-benzyl-acylarylhydrazone hybrids designed as novel multifunctional drug candidates for Alzheimer's disease. Bioorg Med Chem 71:0 (2022) Target
Name:
Cholinesterase
Synonyms:
BCHE CHLE_HORSE | Cholinesterase
Type:
Enzyme
Mol. Mass.:
65643.35
Organism:
Equus caballus (Horse)
Description:
P81908
Residue:
574
  
Inhibitor
Name:
BDBM8960
Synonyms:
(+/-)-2-[(1-benzylpiperidin-4-yl)methyl]-5,6-dimethoxy-indan-1-one Aricept CHEMBL1678 CHEMBL502 Donepezil E2020 US9346818, DPH US9663465, Donepezil
Type:
Small organic molecule
Emp. Form.:
C24H29NO3
Mol. Mass.:
379.492
SMILES:
COc1cc2CC(CC3CCN(Cc4ccccc4)CC3)C(=O)c2cc1OC
: