Target
Metabotropic glutamate receptor 2
Ligand
BDBM50162565
Substrate
Meas. Tech.
ChEMBL_304142 (CHEMBL840258)
EC50
186±n/a nM
Citation
 Pinkerton, ABCube, RVHutchinson, JHJames, JKGardner, MFRowe, BASchaffhauser, HRodriguez, DECampbell, UCDaggett, LPVernier, JM Allosteric potentiators of the metabotropic glutamate receptor 2 (mGlu2). Part 3: Identification and biological activity of indanone containing mGlu2 receptor potentiators. Bioorg Med Chem Lett 15:1565-71 (2005)  
Target
Name:
Metabotropic glutamate receptor 2
Synonyms:
GPRC1B GRM2_HUMAN Metabotropic glutamate receptor mGlu2 | metabotropic glutamate 2
Type:
Enzyme
Mol. Mass.:
95584.88
Organism:
Homo sapiens (Human)
Description:
Q14416
Residue:
872
  
Inhibitor
Name:
BDBM50162565
Synonyms:
6,7-Dichloro-2-propyl-5-[3-(pyridin-4-ylsulfanylmethyl)-benzyloxy]-indan-1-one | CHEMBL181364
Type:
Small organic molecule
Emp. Form.:
C25H23Cl2NO2S
Mol. Mass.:
472.427
SMILES:
CCCC1Cc2cc(OCc3cccc(CSc4ccncc4)c3)c(Cl)c(Cl)c2C1=O
: