Target
Metabotropic glutamate receptor 2
Ligand
BDBM50162567
Substrate
Meas. Tech.
ChEMBL_304142 (CHEMBL840258)
EC50
1160±n/a nM
Citation
 Pinkerton, ABCube, RVHutchinson, JHJames, JKGardner, MFRowe, BASchaffhauser, HRodriguez, DECampbell, UCDaggett, LPVernier, JM Allosteric potentiators of the metabotropic glutamate receptor 2 (mGlu2). Part 3: Identification and biological activity of indanone containing mGlu2 receptor potentiators. Bioorg Med Chem Lett 15:1565-71 (2005)  
Target
Name:
Metabotropic glutamate receptor 2
Synonyms:
GPRC1B GRM2_HUMAN Metabotropic glutamate receptor mGlu2 | metabotropic glutamate 2
Type:
Enzyme
Mol. Mass.:
95584.88
Organism:
Homo sapiens (Human)
Description:
Q14416
Residue:
872
  
Inhibitor
Name:
BDBM50162567
Synonyms:
6,7-Dichloro-2-cyclopentyl-2-methyl-5-{2-[4-(2H-tetrazol-5-yl)-phenyl]-ethyl}-indan-1-one | CHEMBL178823
Type:
Small organic molecule
Emp. Form.:
C24H24Cl2N4O
Mol. Mass.:
455.38
SMILES:
CC1(Cc2cc(CCc3ccc(cc3)-c3nnn[nH]3)c(Cl)c(Cl)c2C1=O)C1CCCC1
: