Target
Metabotropic glutamate receptor 2
Ligand
BDBM50162568
Substrate
Meas. Tech.
ChEMBL_304142 (CHEMBL840258)
EC50
122±n/a nM
Citation
 Pinkerton, ABCube, RVHutchinson, JHJames, JKGardner, MFRowe, BASchaffhauser, HRodriguez, DECampbell, UCDaggett, LPVernier, JM Allosteric potentiators of the metabotropic glutamate receptor 2 (mGlu2). Part 3: Identification and biological activity of indanone containing mGlu2 receptor potentiators. Bioorg Med Chem Lett 15:1565-71 (2005)  
Target
Name:
Metabotropic glutamate receptor 2
Synonyms:
GPRC1B GRM2_HUMAN Metabotropic glutamate receptor mGlu2 | metabotropic glutamate 2
Type:
Enzyme
Mol. Mass.:
95584.88
Organism:
Homo sapiens (Human)
Description:
Q14416
Residue:
872
  
Inhibitor
Name:
BDBM50162568
Synonyms:
6,7-Dichloro-2-cyclopentyl-5-[4-(2H-tetrazol-5-yl)-benzyloxy]-indan-1-one | CHEMBL179939
Type:
Small organic molecule
Emp. Form.:
C22H20Cl2N4O2
Mol. Mass.:
443.326
SMILES:
Clc1c2C(=O)C(Cc2cc(OCc2ccc(cc2)-c2nnn[nH]2)c1Cl)C1CCCC1
: