Target
Metabotropic glutamate receptor 2
Ligand
BDBM50162576
Substrate
Meas. Tech.
ChEMBL_304142 (CHEMBL840258)
EC50
1090±n/a nM
Citation
 Pinkerton, ABCube, RVHutchinson, JHJames, JKGardner, MFRowe, BASchaffhauser, HRodriguez, DECampbell, UCDaggett, LPVernier, JM Allosteric potentiators of the metabotropic glutamate receptor 2 (mGlu2). Part 3: Identification and biological activity of indanone containing mGlu2 receptor potentiators. Bioorg Med Chem Lett 15:1565-71 (2005)  
Target
Name:
Metabotropic glutamate receptor 2
Synonyms:
GPRC1B GRM2_HUMAN Metabotropic glutamate receptor mGlu2 | metabotropic glutamate 2
Type:
Enzyme
Mol. Mass.:
95584.88
Organism:
Homo sapiens (Human)
Description:
Q14416
Residue:
872
  
Inhibitor
Name:
BDBM50162576
Synonyms:
2-Butyl-6,7-dichloro-2-cyclopentyl-5-[4-(2H-tetrazol-5-yl)-benzyloxy]-indan-1-one | CHEMBL361570
Type:
Small organic molecule
Emp. Form.:
C26H28Cl2N4O2
Mol. Mass.:
499.432
SMILES:
CCCCC1(Cc2cc(OCc3ccc(cc3)-c3nnn[nH]3)c(Cl)c(Cl)c2C1=O)C1CCCC1
: