Target
5-hydroxytryptamine receptor 1A
Ligand
BDBM50590648
Substrate
Meas. Tech.
ChEMBL_2197385 (CHEMBL5109901)
Ki
0.099000±n/a nM
Citation
 Fu, HRong, JChen, ZZhou, JCollier, TLiang, SH Positron Emission Tomography (PET) Imaging Tracers for Serotonin Receptors. J Med Chem 65:10755-10808 (2022) Target
Name:
5-hydroxytryptamine receptor 1A
Synonyms:
5-HT-1A 5-HT1A 5-hydroxytryptamine receptor 1A (5HT1A) 5ht1a Htr1a Serotonin 1a (5-HT1a) receptor/Adrenergic receptor alpha-1 | Serotonin receptor 1A
Type:
G Protein-Coupled Receptor (GPCR)
Mol. Mass.:
46445.29
Organism:
Rattus norvegicus (rat)
Description:
Binding assays were performed using rat hippocampal membranes.
Residue:
422
  
Inhibitor
Name:
BDBM50590648
Synonyms:
CHEMBL5202019
Type:
Small organic molecule
Emp. Form.:
C49H71FN10O5Si
Mol. Mass.:
926.2385
SMILES:
[#6]-[#8]-c1ccccc1-[#7]-1-[#6]-[#6]-[#7](-[#6]-[#6]-n2cc(-[#6]-[#8]-[#6]-[#6](-[#6]-[#8]-c3ccc(cc3)[Si;v4]([18F])(C([#6])([#6])[#6])C([#6])([#6])[#6])-[#8]-[#6]-c3cn(-[#6]-[#6]-[#7]-4-[#6]-[#6]-[#7](-[#6]-[#6]-4)-c4ccccc4-[#8]-[#6])nn3)nn2)-[#6]-[#6]-1
: