Target
5-hydroxytryptamine receptor 1F
Ligand
BDBM50573975
Substrate
Meas. Tech.
ChEMBL_2197519 (CHEMBL5110035)
Ki
2.2±n/a nM
Citation
 Fu, HRong, JChen, ZZhou, JCollier, TLiang, SH Positron Emission Tomography (PET) Imaging Tracers for Serotonin Receptors. J Med Chem 65:10755-10808 (2022) Target
Name:
5-hydroxytryptamine receptor 1F
Synonyms:
5-HT-1F 5-hydroxytryptamine receptor 1F HTR1EL Serotonin (5-HT) receptor Serotonin receptor 1F
Type:
Enzyme Catalytic Domain
Mol. Mass.:
41724.68
Organism:
Homo sapiens (Human)
Description:
5-HT1F HTR1F HUMAN::P30939
Residue:
366
  
Inhibitor
Name:
BDBM50573975
Synonyms:
COL-144 Lasmiditan
Type:
Small organic molecule
Emp. Form.:
C19H18F3N3O2
Mol. Mass.:
377.3603
SMILES:
CN1CCC(CC1)C(=O)c1cccc(NC(=O)c2c(F)cc(F)cc2F)n1
: