Target
5-hydroxytryptamine receptor 1F
Ligand
BDBM50137542
Substrate
Meas. Tech.
ChEMBL_2197521 (CHEMBL5110037)
Ki
8.2±n/a nM
Citation
 Fu, HRong, JChen, ZZhou, JCollier, TLiang, SH Positron Emission Tomography (PET) Imaging Tracers for Serotonin Receptors. J Med Chem 65:10755-10808 (2022) Target
Name:
5-hydroxytryptamine receptor 1F
Synonyms:
5-HT-1F 5-hydroxytryptamine receptor 1F HTR1EL Serotonin (5-HT) receptor Serotonin receptor 1F
Type:
Enzyme Catalytic Domain
Mol. Mass.:
41724.68
Organism:
Homo sapiens (Human)
Description:
5-HT1F HTR1F HUMAN::P30939
Residue:
366
  
Inhibitor
Name:
BDBM50137542
Synonyms:
CHEMBL178066 | N-[3-(2-Dimethylamino-ethyl)-2-methyl-1H-indol-5-yl]-4-fluoro-benzamide
Type:
Small organic molecule
Emp. Form.:
C20H22FN3O
Mol. Mass.:
339.4066
SMILES:
CN(C)CCc1c(C)[nH]c2ccc(NC(=O)c3ccc(F)cc3)cc12
: