Target
5-hydroxytryptamine receptor 1F
Ligand
BDBM50130448
Substrate
Meas. Tech.
ChEMBL_2197521 (CHEMBL5110037)
Ki
5.0±n/a nM
Citation
 Fu, HRong, JChen, ZZhou, JCollier, TLiang, SH Positron Emission Tomography (PET) Imaging Tracers for Serotonin Receptors. J Med Chem 65:10755-10808 (2022) Target
Name:
5-hydroxytryptamine receptor 1F
Synonyms:
5-HT-1F 5-hydroxytryptamine receptor 1F HTR1EL Serotonin (5-HT) receptor Serotonin receptor 1F
Type:
Enzyme Catalytic Domain
Mol. Mass.:
41724.68
Organism:
Homo sapiens (Human)
Description:
5-HT1F HTR1F HUMAN::P30939
Residue:
366
  
Inhibitor
Name:
BDBM50130448
Synonyms:
CHEMBL431041 | N-[3-(1-Methyl-piperidin-4-yl)-1H-pyrrolo[3,2-b]pyridin-5-yl]-acetamide
Type:
Small organic molecule
Emp. Form.:
C15H20N4O
Mol. Mass.:
272.3455
SMILES:
CN1CCC(CC1)c1c[nH]c2ccc(NC(C)=O)nc12
: