Target
Carbonic anhydrase 4
Ligand
BDBM50011181
Substrate
Meas. Tech.
ChEMBL_303009 (CHEMBL830248)
Ki
820000.0±n/a nM
Citation
 Winum, JYInnocenti, AGagnard, VMontero, JLScozzafava, AVullo, DSupuran, CT Carbonic anhydrase inhibitors. Interaction of isozymes I, II, IV, V, and IX with organic phosphates and phosphonates. Bioorg Med Chem Lett 15:1683-6 (2005)  
Target
Name:
Carbonic anhydrase 4
Synonyms:
CA-IV CAH4_HUMAN Carbonic anhydrase Carbonic anhydrase IV (CA IV)
Type:
Enzyme
Mol. Mass.:
35037.98
Organism:
Homo sapiens (Human)
Description:
P22748
Residue:
312
  
Inhibitor
Name:
BDBM50011181
Synonyms:
(PFA)dihydroxyphosphinecarboxylic acid oxide FOSCARNET Foscarnet (PFA) Phosphono-formic acid(PFA) dihydroxyphosphinecarboxylic acid oxide phosphonoformic acid(PFA)
Type:
Small organic molecule
Emp. Form.:
CH3O5P
Mol. Mass.:
126.0053
SMILES:
OC(=O)P(O)(O)=O
: