Target
Geranylgeranyl transferase type-1 subunit beta/Protein farnesyltransferase/geranylgeranyltransferase type-1 subunit alpha
Ligand
BDBM50162884
Substrate
Meas. Tech.
ChEMBL_306273 (CHEMBL827550)
IC50
90±n/a nM
Citation
 Saha, AKEnd, DW Novel beta-(imidazol-4-yl)-beta-amino acids: solid-phase synthesis and study of their inhibitory activity against geranylgeranyl protein transferase type I. Bioorg Med Chem Lett 15:1713-9 (2005)  
Target
Name:
Geranylgeranyl transferase type-1 subunit beta/Protein farnesyltransferase/geranylgeranyltransferase type-1 subunit alpha
Synonyms:
Geranylgeranyl transferase type I Geranylgeranyl transferase type I beta/Protein farnesyltransferase/geranylgeranyltransferase type I alpha subunit
Type:
Mol. Mass.:
Description:
ASSAY_ID of EBI is 70196
Components:
This complex has 2 components.
Component 1
Name:
Protein farnesyltransferase/geranylgeranyltransferase type-1 subunit alpha
Synonyms:
CAAX farnesyltransferase alpha subunit FNTA_HUMAN FTase-alpha Geranylgeranyl Transferase (GGTase-I) Chain A Protein Farnesyltransferase (PFT) Chain A Protein farnesyltransferase Protein farnesyltransferase/geranylgeranyltransferase type I alpha subunit | Ras proteins prenyltransferase alpha
Type:
Enzyme
Mol. Mass.:
44392.46
Organism:
Homo sapiens (Human)
Description:
Recombinant human FTase.
Residue:
379
  
Component 2
Name:
Geranylgeranyl transferase type-1 subunit beta
Synonyms:
2.5.1.59 Geranylgeranyl transferase type I Geranylgeranyl transferase type I subunit beta PGGT1B Protein farnesyl/geranylgeranyl transferase | Type I protein geranyl-geranyltransferase subunit beta
Type:
Mol. Mass.:
42369.84
Organism:
Homo sapiens (Human)
Description:
Residue:
377
  
Inhibitor
Name:
BDBM50162884
Synonyms:
3-[[2-(4-Fluoro-phenyl)-ethyl]-(4-phenoxy-benzyl)-amino]-3-(1H-imidazol-4-yl)-propionic acid | CHEMBL426056
Type:
Small organic molecule
Emp. Form.:
C27H26FN3O3
Mol. Mass.:
459.512
SMILES:
OC(=O)CC(N(CCc1ccc(F)cc1)Cc1ccc(Oc2ccccc2)cc1)c1cnc[nH]1
: