Target
Geranylgeranyl transferase type-1 subunit beta/Protein farnesyltransferase/geranylgeranyltransferase type-1 subunit alpha
Ligand
BDBM50162888
Substrate
Meas. Tech.
ChEMBL_306273 (CHEMBL827550)
IC50
460±n/a nM
Citation
 Saha, AKEnd, DW Novel beta-(imidazol-4-yl)-beta-amino acids: solid-phase synthesis and study of their inhibitory activity against geranylgeranyl protein transferase type I. Bioorg Med Chem Lett 15:1713-9 (2005)  
Target
Name:
Geranylgeranyl transferase type-1 subunit beta/Protein farnesyltransferase/geranylgeranyltransferase type-1 subunit alpha
Synonyms:
Geranylgeranyl transferase type I Geranylgeranyl transferase type I beta/Protein farnesyltransferase/geranylgeranyltransferase type I alpha subunit
Type:
Mol. Mass.:
Description:
ASSAY_ID of EBI is 70196
Components:
This complex has 2 components.
Component 1
Name:
Protein farnesyltransferase/geranylgeranyltransferase type-1 subunit alpha
Synonyms:
CAAX farnesyltransferase alpha subunit FNTA_HUMAN FTase-alpha Geranylgeranyl Transferase (GGTase-I) Chain A Protein Farnesyltransferase (PFT) Chain A Protein farnesyltransferase Protein farnesyltransferase/geranylgeranyltransferase type I alpha subunit | Ras proteins prenyltransferase alpha
Type:
Enzyme
Mol. Mass.:
44392.46
Organism:
Homo sapiens (Human)
Description:
Recombinant human FTase.
Residue:
379
  
Component 2
Name:
Geranylgeranyl transferase type-1 subunit beta
Synonyms:
2.5.1.59 Geranylgeranyl transferase type I Geranylgeranyl transferase type I subunit beta PGGT1B Protein farnesyl/geranylgeranyl transferase | Type I protein geranyl-geranyltransferase subunit beta
Type:
Mol. Mass.:
42369.84
Organism:
Homo sapiens (Human)
Description:
Residue:
377
  
Inhibitor
Name:
BDBM50162888
Synonyms:
CHEMBL426604 | [2-(4-Fluoro-phenyl)-ethyl]-(1H-imidazol-4-ylmethyl)-(4-phenoxy-benzyl)-amine
Type:
Small organic molecule
Emp. Form.:
C25H24FN3O
Mol. Mass.:
401.476
SMILES:
Fc1ccc(CCN(Cc2cnc[nH]2)Cc2ccc(Oc3ccccc3)cc2)cc1
: