Target
Transporter
Ligand
BDBM50162957
Substrate
Meas. Tech.
ChEMBL_303056 (CHEMBL828882)
Ki
1.6±n/a nM
Citation
 Fernández, JAlonso, JMAndrés, JICid, JMDíaz, AIturrino, LGil, PMegens, ASipido, VKTrabanco, AA Discovery of new tetracyclic tetrahydrofuran derivatives as potential broad-spectrum psychotropic agents. J Med Chem 48:1709-12 (2005)  
Target
Name:
Transporter
Synonyms:
Monoamine transporters; Norepininephrine & dopamine | Norepinephrine Monoamine transporters
Type:
PROTEIN
Mol. Mass.:
66787.87
Organism:
Rattus norvegicus
Description:
ChEMBL_1463061
Residue:
597
  
Inhibitor
Name:
BDBM50162957
Synonyms:
(11-Fluoro-2,3,3a,12b-tetrahydro-1-oxa-8-thia-dibenzo[e,h]azulen-2-ylmethyl)-dimethyl-amine | CHEMBL193639
Type:
Small organic molecule
Emp. Form.:
C19H20FNOS
Mol. Mass.:
329.432
SMILES:
CN(C)C[C@H]1CC2[C@H](O1)c1cc(F)ccc1Sc1ccccc21
: