Target
Adenosine receptor A1
Ligand
BDBM50163016
Substrate
Meas. Tech.
ChEMBL_303105 (CHEMBL829615)
Ki
240±n/a nM
Citation
 Tchilibon, SJoshi, BVKim, SKDuong, HTGao, ZGJacobson, KA (N)-methanocarba 2,N6-disubstituted adenine nucleosides as highly potent and selective A3 adenosine receptor agonists. J Med Chem 48:1745-58 (2005)  
Target
Name:
Adenosine receptor A1
Synonyms:
A1 adenosine receptor (hA1) AA1R_HUMAN ADORA1 Adenosine A1-receptor Adenosine receptor A1 (hA1) | Adenosine transporter (AdT)
Type:
G Protein-Coupled Receptor (GPCR)
Mol. Mass.:
36520.92
Organism:
Homo sapiens (Human)
Description:
P30542
Residue:
326
  
Inhibitor
Name:
BDBM50163016
Synonyms:
(1S,2R,3S,4R,5S)-4-(6-(5-chloro-2-methoxybenzylamino)-2-chloro-9H-purin-9-yl)-2,3-dihydroxy-N-methylbicyclo[3.1.0]hexane-1-carboxamide CHEMBL353319
Type:
Small organic molecule
Emp. Form.:
C21H22Cl2N6O4
Mol. Mass.:
493.343
SMILES:
CNC(=O)[C@@]12C[C@@H]1[C@H]([C@H](O)[C@@H]2O)n1cnc2c(NCc3cc(Cl)ccc3OC)nc(Cl)nc12
: