Target
Alpha-2A adrenergic receptor [16-465]
Ligand
BDBM13026
Substrate
Meas. Tech.
ChEMBL_302984 (CHEMBL828833)
Ki
1200000±n/a nM
Citation
 Grunewald, GLRomero, FACriscione, KR Nanomolar inhibitors of CNS epinephrine biosynthesis: (R)-(+)-3-fluoromethyl-7-(N-substituted aminosulfonyl)-1,2,3,4-tetrahydroisoquinolines as potent and highly selective inhibitors of phenylethanolamine N-methyltransferase1. J Med Chem 48:1806-12 (2005)  
Target
Name:
Alpha-2A adrenergic receptor [16-465]
Synonyms:
ADA2A_RAT Adrenaline 2 Alpha-2A adrenoceptor Alpha-2AAR Alpha2 Adrenoreceptor adrenergic Alpha2A
Type:
G-protein coupled receptor
Mol. Mass.:
48961.69
Organism:
Rattus norvegicus (rat)
Description:
P22909[16-465]
Residue:
450
  
Inhibitor
Name:
BDBM13026
Synonyms:
3-(fluoromethyl)-N-(2,2,2-trifluoroethyl)-1,2,3,4-tetrahydroisoquinoline-7-sulfonamide CHEMBL178695
Type:
Small organic molecule
Emp. Form.:
C12H14F4N2O2S
Mol. Mass.:
326.31
SMILES:
FCC1Cc2ccc(cc2CN1)S(=O)(=O)NCC(F)(F)F
: