Target
Alpha-2A adrenergic receptor [16-465]
Ligand
BDBM50163108
Substrate
Meas. Tech.
ChEMBL_302984 (CHEMBL828833)
Ki
670000±n/a nM
Citation
 Grunewald, GLRomero, FACriscione, KR Nanomolar inhibitors of CNS epinephrine biosynthesis: (R)-(+)-3-fluoromethyl-7-(N-substituted aminosulfonyl)-1,2,3,4-tetrahydroisoquinolines as potent and highly selective inhibitors of phenylethanolamine N-methyltransferase1. J Med Chem 48:1806-12 (2005)  
Target
Name:
Alpha-2A adrenergic receptor [16-465]
Synonyms:
ADA2A_RAT Adrenaline 2 Alpha-2A adrenoceptor Alpha-2AAR Alpha2 Adrenoreceptor adrenergic Alpha2A
Type:
G-protein coupled receptor
Mol. Mass.:
48961.69
Organism:
Rattus norvegicus (rat)
Description:
P22909[16-465]
Residue:
450
  
Inhibitor
Name:
BDBM50163108
Synonyms:
(3R)-3-(FLUOROMETHYL)-N-(3,3,3-TRIFLUOROPROPYL)-1,2,3,4-TETRAHYDROISOQUINOLINE-7-SULFONAMIDE CHEMBL177101
Type:
Small organic molecule
Emp. Form.:
C13H16F4N2O2S
Mol. Mass.:
340.337
SMILES:
FC[C@H]1Cc2ccc(cc2CN1)S(=O)(=O)NCCC(F)(F)F
: