Target
Phenylethanolamine N-methyltransferase
Ligand
BDBM50163104
Substrate
Meas. Tech.
ChEMBL_303574 (CHEMBL828974)
Ki
61±n/a nM
Citation
 Grunewald, GLRomero, FACriscione, KR Nanomolar inhibitors of CNS epinephrine biosynthesis: (R)-(+)-3-fluoromethyl-7-(N-substituted aminosulfonyl)-1,2,3,4-tetrahydroisoquinolines as potent and highly selective inhibitors of phenylethanolamine N-methyltransferase1. J Med Chem 48:1806-12 (2005)  
Target
Name:
Phenylethanolamine N-methyltransferase
Synonyms:
Noradrenaline N-methyltransferase PNMT PNMTase | Phenylethanolamine N-Methyltransferase (PNMT)
Type:
Enzyme
Mol. Mass.:
30852.66
Organism:
Homo sapiens (Human)
Description:
Residue:
282
  
Inhibitor
Name:
BDBM50163104
Synonyms:
(R)-3-Fluoromethyl-1,2,3,4-tetrahydro-isoquinoline-7-sulfonic acid (2,2,2-trifluoro-ethyl)-amide | CHEMBL425522
Type:
Small organic molecule
Emp. Form.:
C12H14F4N2O2S
Mol. Mass.:
326.31
SMILES:
FC[C@H]1Cc2ccc(cc2CN1)S(=O)(=O)NCC(F)(F)F
: