Target
Fucose-binding lectin PA-IIL
Ligand
BDBM50166886
Substrate
Meas. Tech.
ChEMBL_2199749 (CHEMBL5112265)
IC50
46800±n/a nM
Citation
 Meiers, JRox, KTitz, A Lectin-Targeted Prodrugs Activated by  J Med Chem 65:13988-14014 (2022) Target
Name:
Fucose-binding lectin PA-IIL
Synonyms:
LecB | PA-IIL
Type:
Protein
Mol. Mass.:
11857.84
Organism:
Pseudomonas aeruginosa
Description:
Q9HYN5
Residue:
115
  
Inhibitor
Name:
BDBM50166886
Synonyms:
CHEMBL195368 | methyl alpha-D-mannoside
Type:
Small organic molecule
Emp. Form.:
C7H14O6
Mol. Mass.:
194.1825
SMILES:
CO[C@H]1O[C@H](CO)[C@@H](O)[C@H](O)[C@@H]1O
: