Target
Protein polybromo-1
Ligand
BDBM50591371
Substrate
Meas. Tech.
ChEMBL_2200134 (CHEMBL5112650)
IC50
220±n/a nM
Citation
 Shishodia, SNuņez, RStrohmier, BPBursch, KLGoetz, CJOlp, MDJensen, DRFenske, TGOrdonez-Rubiano, SCBlau, MERoach, MKPeterson, FCVolkman, BFDykhuizen, ECSmith, BC Selective and Cell-Active PBRM1 Bromodomain Inhibitors Discovered through NMR Fragment Screening. J Med Chem 65:13714-13735 (2022) Target
Name:
Protein polybromo-1
Synonyms:
BAF180 PB1 PBRM1 hPB1
Type:
PROTEIN
Mol. Mass.:
192953.62
Organism:
Homo sapiens (Human)
Description:
ChEMBL_104264
Residue:
1689
  
Inhibitor
Name:
BDBM50591371
Synonyms:
CHEMBL5187356
Type:
Small organic molecule
Emp. Form.:
C16H15ClN2O
Mol. Mass.:
286.756
SMILES:
Cc1cccc(C2NC(=O)c3c(Cl)cccc3N2)c1C
: