Target
Peroxisome proliferator-activated receptor gamma
Ligand
BDBM50591464
Substrate
Meas. Tech.
ChEMBL_2200547 (CHEMBL5113063)
IC50
4.4±n/a nM
Citation
 Orsi, DLPook, EBräuer, NFriberg, ALienau, PLemke, CTStellfeld, TBrüggemeier, UPütter, VMeyer, HBaco, MTang, SCherniack, ADWestlake, LBender, SAKocak, MStrathdee, CAMeyerson, MEis, KGoldstein, JT Discovery and Structure-Based Design of Potent Covalent PPAR? Inverse-Agonists  J Med Chem 65:14843-14863 (2022) Target
Name:
Peroxisome proliferator-activated receptor gamma
Synonyms:
NR1C3 PPAR-gamma PPARG_HUMAN Peroxisome proliferator-activated receptor gamma (PPAR gamma) Peroxisome proliferator-activated receptor gamma (PPARγ) peroxisome proliferator-activated receptor gamma isoform 2
Type:
Nuclear Receptor
Mol. Mass.:
57613.46
Organism:
Homo sapiens (Human)
Description:
P37231
Residue:
505
  
Inhibitor
Name:
BDBM50591464
Synonyms:
CHEMBL5183657
Type:
Small organic molecule
Emp. Form.:
C23H19ClN4O3
Mol. Mass.:
434.875
SMILES:
CCc1ccc(cc1)-c1nc2cc(NC(=O)c3cc(ccc3Cl)[N+]([O-])=O)ccc2n1C
: