Target
Peroxisome proliferator-activated receptor gamma
Ligand
BDBM50591465
Substrate
Meas. Tech.
ChEMBL_2200547 (CHEMBL5113063)
IC50
0.580000±n/a nM
Citation
 Orsi, DLPook, EBräuer, NFriberg, ALienau, PLemke, CTStellfeld, TBrüggemeier, UPütter, VMeyer, HBaco, MTang, SCherniack, ADWestlake, LBender, SAKocak, MStrathdee, CAMeyerson, MEis, KGoldstein, JT Discovery and Structure-Based Design of Potent Covalent PPAR? Inverse-Agonists  J Med Chem 65:14843-14863 (2022) Target
Name:
Peroxisome proliferator-activated receptor gamma
Synonyms:
NR1C3 PPAR-gamma PPARG_HUMAN Peroxisome proliferator-activated receptor gamma (PPAR gamma) Peroxisome proliferator-activated receptor gamma (PPARγ) peroxisome proliferator-activated receptor gamma isoform 2
Type:
Nuclear Receptor
Mol. Mass.:
57613.46
Organism:
Homo sapiens (Human)
Description:
P37231
Residue:
505
  
Inhibitor
Name:
BDBM50591465
Synonyms:
CHEMBL5201278
Type:
Small organic molecule
Emp. Form.:
C20H13ClN4O3
Mol. Mass.:
392.795
SMILES:
[O-][N+](=O)c1ccc(Cl)c(c1)C(=O)Nc1ccc2nc(cn2c1)-c1ccccc1
: