Target
Peroxisome proliferator-activated receptor gamma
Ligand
BDBM50591468
Substrate
Meas. Tech.
ChEMBL_2200547 (CHEMBL5113063)
IC50
1.6±n/a nM
Citation
 Orsi, DLPook, EBräuer, NFriberg, ALienau, PLemke, CTStellfeld, TBrüggemeier, UPütter, VMeyer, HBaco, MTang, SCherniack, ADWestlake, LBender, SAKocak, MStrathdee, CAMeyerson, MEis, KGoldstein, JT Discovery and Structure-Based Design of Potent Covalent PPAR? Inverse-Agonists  J Med Chem 65:14843-14863 (2022) Target
Name:
Peroxisome proliferator-activated receptor gamma
Synonyms:
NR1C3 PPAR-gamma PPARG_HUMAN Peroxisome proliferator-activated receptor gamma (PPAR gamma) Peroxisome proliferator-activated receptor gamma (PPARγ) peroxisome proliferator-activated receptor gamma isoform 2
Type:
Nuclear Receptor
Mol. Mass.:
57613.46
Organism:
Homo sapiens (Human)
Description:
P37231
Residue:
505
  
Inhibitor
Name:
BDBM50591468
Synonyms:
CHEMBL5184027
Type:
Small organic molecule
Emp. Form.:
C22H16ClN3O4
Mol. Mass.:
421.833
SMILES:
Cc1cc2nc(oc2cc1C)-c1ccc(NC(=O)c2cc(ccc2Cl)[N+]([O-])=O)cc1
: