Target
Peroxisome proliferator-activated receptor gamma
Ligand
BDBM50591479
Substrate
Meas. Tech.
ChEMBL_2200565 (CHEMBL5113081)
IC50
24±n/a nM
Citation
 Orsi, DLPook, EBräuer, NFriberg, ALienau, PLemke, CTStellfeld, TBrüggemeier, UPütter, VMeyer, HBaco, MTang, SCherniack, ADWestlake, LBender, SAKocak, MStrathdee, CAMeyerson, MEis, KGoldstein, JT Discovery and Structure-Based Design of Potent Covalent PPAR? Inverse-Agonists  J Med Chem 65:14843-14863 (2022) Target
Name:
Peroxisome proliferator-activated receptor gamma
Synonyms:
Nr1c3 PPAR-gamma Pparg
Type:
PROTEIN
Mol. Mass.:
57593.55
Organism:
Mus musculus
Description:
ChEMBL_1453700
Residue:
505
  
Inhibitor
Name:
BDBM50591479
Synonyms:
CHEMBL5187164
Type:
Small organic molecule
Emp. Form.:
C22H16BrN3O4
Mol. Mass.:
466.284
SMILES:
CCc1ccc(cc1)-c1nc2cc(NC(=O)c3cc(ccc3Br)[N+]([O-])=O)ccc2o1
: