Target
Amyloid-beta precursor protein
Ligand
BDBM50163998
Substrate
Meas. Tech.
ChEMBL_304202 (CHEMBL829742)
EC50
24500±n/a nM
Citation
 Gundersen, EFan, KHaas, KHuryn, DSteven Jacobsen, JKreft, AMartone, RMayer, SSonnenberg-Reines, JSun, SCZhou, H Molecular-modeling based design, synthesis, and activity of substituted piperidines as gamma-secretase inhibitors. Bioorg Med Chem Lett 15:1891-4 (2005)  
Target
Name:
Amyloid-beta precursor protein
Synonyms:
A4 ABPP AICD-50 AICD-59 AID(57) APP Alzheimer disease amyloid protein Amyloid beta Protein Amyloid beta protein Abeta(1-42) Amyloid intracellular domain 57 Amyloid protein (Abeta42b) Beta amyloid A4 protein Beta-APP42 Beta-amyloid protein 42 C83 CVAP Gamma Secretase Gamma-CTF(57) Gamma-secretase Gamma-secretase C-terminal fragment 57 P3(40) PN-II Protease nexin-II S-APP-beta Soluble APP-beta | beta-Amyloid Precursor Protein (APP)
Type:
Single-pass type I membrane protein
Mol. Mass.:
86890.41
Organism:
Homo sapiens (Human)
Description:
P05067
Residue:
770
  
Inhibitor
Name:
BDBM50163998
Synonyms:
4-(4-Methoxy-benzenesulfonyl)-4-o-tolyl-piperidine-1-carboxylic acid ethyl ester | CHEMBL360341
Type:
Small organic molecule
Emp. Form.:
C22H27NO5S
Mol. Mass.:
417.518
SMILES:
CCOC(=O)N1CCC(CC1)(c1ccccc1C)S(=O)(=O)c1ccc(OC)cc1
: