Target
D(2) dopamine receptor
Ligand
BDBM50116766
Substrate
Meas. Tech.
ChEMBL_304370 (CHEMBL829012)
EC50
9.2±n/a nM
Citation
 Boeckler, FOhnmacht, ULehmann, TUtz, WHübner, HGmeiner, P CoMFA and CoMSIA investigations revealing novel insights into the binding modes of dopamine D3 receptor agonists. J Med Chem 48:2493-508 (2005)  
Target
Name:
D(2) dopamine receptor
Synonyms:
DOPAMINE D2 DOPAMINE D2 Short Dopamine D2 receptor Drd2
Type:
G Protein-Coupled Receptor (GPCR)
Mol. Mass.:
50931.60
Organism:
Rattus norvegicus (rat)
Description:
P61169
Residue:
444
  
Inhibitor
Name:
BDBM50116766
Synonyms:
(-)-Pramipexole 2,6-Benzothiazolediamine, 4,5,6,7-tetrahydro-N(sup 6)-propyl-, (S)- PRAMIPEXOLE | cid_119570
Type:
Small organic molecule
Emp. Form.:
C10H17N3S
Mol. Mass.:
211.327
SMILES:
CCCN[C@H]1CCc2nc(N)sc2C1
: