Target
14-3-3 protein eta
Ligand
BDBM50591822
Substrate
Meas. Tech.
ChEMBL_2201840 (CHEMBL5114548)
Kd
35000±n/a nM
Citation
 Gao, ZFan, TChen, LYang, MWai Wong, VKChen, DLiu, ZZhou, YWu, WQiu, ZZhang, CLi, YJiang, Y Design, synthesis and antitumor evaluation of novel 1H-indole-2-carboxylic acid derivatives targeting 14-3-3? protein. Eur J Med Chem 238:0 (2022) Target
Name:
14-3-3 protein eta
Synonyms:
14-3-3 protein eta Protein AS1 YWHAH
Type:
PROTEIN
Mol. Mass.:
28205.81
Organism:
Homo sapiens (Human)
Description:
ChEMBL_110546
Residue:
246
  
Inhibitor
Name:
BDBM50591822
Synonyms:
CHEMBL5174718
Type:
Small organic molecule
Emp. Form.:
C29H32N2O3
Mol. Mass.:
456.576
SMILES:
COc1cccc(CNCc2c(C(O)=O)n(Cc3ccc(C)cc3)c3cc(ccc23)C(C)C)c1
: