Target
Glutamate receptor ionotropic, NMDA 1/2B
Ligand
BDBM50164548
Substrate
Meas. Tech.
ChEMBL_303759 (CHEMBL828982)
Ki
2150±n/a nM
Citation
 Morley, RMTse, HWFeng, BMiller, JCMonaghan, DTJane, DE Synthesis and pharmacology of N1-substituted piperazine-2,3-dicarboxylic acid derivatives acting as NMDA receptor antagonists. J Med Chem 48:2627-37 (2005)  
Target
Name:
Glutamate receptor ionotropic, NMDA 1/2B
Synonyms:
Glutamate NMDA receptor; Grin1/Grin2b | Glutamate [NMDA] receptor subunit epsilon 2/zeta 1
Type:
Mol. Mass.:
Description:
ASSAY_ID of EBI is 141026
Components:
This complex has 2 components.
Component 1
Name:
Glutamate receptor ionotropic, NMDA 2B
Synonyms:
GluN2B Grin2b NMDA receptor subunit N2B (GluN2B) NMDE2_RAT | NR2B
Type:
Protein
Mol. Mass.:
166077.66
Organism:
Rattus norvegicus (Rat)
Description:
Q00960
Residue:
1482
  
Component 2
Name:
Glutamate receptor ionotropic, NMDA 1
Synonyms:
Glutamate (NMDA) receptor subunit zeta 1 Glutamate-NMDA-Channel Glutamate-NMDA-Polyamine NMDA Nmdar1 | phencyclidine
Type:
Enzyme Catalytic Domain
Mol. Mass.:
105533.40
Organism:
RAT
Description:
P35439
Residue:
938
  
Inhibitor
Name:
BDBM50164548
Synonyms:
(2R,3S)-1-(7-Bromo-9,10-dihydro-phenanthrene-2-carbonyl)-piperazine-2,3-dicarboxylic acid | CHEMBL192728
Type:
Small organic molecule
Emp. Form.:
C21H19BrN2O5
Mol. Mass.:
459.29
SMILES:
OC(=O)[C@H]1NCCN([C@H]1C(O)=O)C(=O)c1ccc-2c(CCc3cc(Br)ccc-23)c1
: