Target
Glutamate receptor ionotropic, NMDA 1/2A
Ligand
BDBM50111396
Substrate
Meas. Tech.
ChEMBL_303758 (CHEMBL829801)
Ki
5.4±n/a nM
Citation
 Morley, RMTse, HWFeng, BMiller, JCMonaghan, DTJane, DE Synthesis and pharmacology of N1-substituted piperazine-2,3-dicarboxylic acid derivatives acting as NMDA receptor antagonists. J Med Chem 48:2627-37 (2005)  
Target
Name:
Glutamate receptor ionotropic, NMDA 1/2A
Synonyms:
Glutamate NMDA receptor; Grin1/Grin2a | Glutamate [NMDA] receptor subunit epsilon 1/zeta 1
Type:
Mol. Mass.:
Description:
ASSAY_ID of EBI is 141020
Components:
This complex has 2 components.
Component 1
Name:
Glutamate receptor ionotropic, NMDA 2A
Synonyms:
Glutamate NMDA receptor; Grin1/Grin2a Grin2a NMDE1_RAT
Type:
Protein
Mol. Mass.:
165478.25
Organism:
Rattus norvegicus (Rat)
Description:
Q00959
Residue:
1464
  
Component 2
Name:
Glutamate receptor ionotropic, NMDA 1
Synonyms:
Glutamate (NMDA) receptor subunit zeta 1 Glutamate-NMDA-Channel Glutamate-NMDA-Polyamine NMDA Nmdar1 | phencyclidine
Type:
Enzyme Catalytic Domain
Mol. Mass.:
105533.40
Organism:
RAT
Description:
P35439
Residue:
938
  
Inhibitor
Name:
BDBM50111396
Synonyms:
CHEMBL273636 [[1-((S)-4-Bromo-phenyl)-ethylamino]-(2,3-dioxo-1,2,3,4-tetrahydro-quinoxalin-5-yl)-methyl]-phosphonic acid
Type:
Small organic molecule
Emp. Form.:
C17H17BrN3O5P
Mol. Mass.:
454.212
SMILES:
C[C@H](NC(c1cccc2[nH]c(=O)c(=O)[nH]c12)P(O)(O)=O)c1ccc(Br)cc1
: