Target
Muscarinic acetylcholine receptor M2
Ligand
BDBM50165008
Substrate
Meas. Tech.
ChEMBL_302412 (CHEMBL875203)
Ki
6.91±n/a nM
Citation
 Kaur, KAeron, SBruhaspathy, MShetty, SJGupta, SHegde, LHSilamkoti, ADMehta, AChugh, AGupta, JBSarma, PKKumar, N Design, synthesis and activity of novel derivatives of oxybutynin and tolterodine. Bioorg Med Chem Lett 15:2093-6 (2005)  
Target
Name:
Muscarinic acetylcholine receptor M2
Synonyms:
ACM2_RAT Chrm-2 | Chrm2
Type:
Enzyme Catalytic Domain
Mol. Mass.:
51555.53
Organism:
RAT
Description:
P10980
Residue:
466
  
Inhibitor
Name:
BDBM50165008
Synonyms:
(+)-(R)-2-(alpha-(2-(Diisopropylamino)ethyl)benzyl)-p-cresol 2-[(1R)-3-(diisopropylamino)-1-phenylpropyl]-4-methylphenol TOLTERODINE
Type:
Small organic molecule
Emp. Form.:
C22H31NO
Mol. Mass.:
325.4876
SMILES:
CC(C)N(CC[C@H](c1ccccc1)c1cc(C)ccc1O)C(C)C
: