Target
Nitric oxide synthase, inducible
Ligand
BDBM50592473
Substrate
Meas. Tech.
ChEMBL_2204400 (CHEMBL5117108)
Ki
669±n/a nM
Citation
 Vasu, DLi, HHardy, CDPoulos, TLSilverman, RB 2-Aminopyridines with a shortened amino sidechain as potent, selective, and highly permeable human neuronal nitric oxide synthase inhibitors. Bioorg Med Chem 69:0 (2022) Target
Name:
Nitric oxide synthase, inducible
Synonyms:
HEP-NOS Inducible NO synthase NOS type II NOS2A Nitric oxide synthase, inducible (iNOS) | iNOS
Type:
Homodimer
Mol. Mass.:
131141.95
Organism:
Homo sapiens (Human)
Description:
P35228
Residue:
1153
  
Inhibitor
Name:
BDBM50592473
Synonyms:
CHEMBL5191295
Type:
Small organic molecule
Emp. Form.:
C10H17N3
Mol. Mass.:
179.2621
SMILES:
CNCCCc1cc(C)cc(N)n1
: