Target
Gamma-aminobutyric acid receptor subunit alpha-5/beta-3/gamma-2
Ligand
BDBM50165329
Substrate
Meas. Tech.
ChEMBL_303744 (CHEMBL829787)
Ki
7.57±n/a nM
Citation
 Primofiore, GDa Settimo, FTaliani, SSalerno, SNovellino, EGreco, GCosimelli, BBesnard, FCosta, BMontali, MMartini, C High affinity central benzodiazepine receptor ligands: synthesis and biological evaluation of a series of phenyltriazolobenzotriazindione derivatives. J Med Chem 48:2936-43 (2005)  
Target
Name:
Gamma-aminobutyric acid receptor subunit alpha-5/beta-3/gamma-2
Synonyms:
GABA A receptor alpha-5/beta-3/gamma-2 | GABA receptor alpha-5/beta-3/gamma-2 subunit
Type:
Mol. Mass.:
Description:
ASSAY_ID of EBI is 70706
Components:
This complex has 3 components.
Component 1
Name:
Gamma-aminobutyric acid receptor subunit gamma-2
Synonyms:
GBRG2_RAT Gamma-aminobutyric acid receptor subunit gamma-2 (GABA(A) gamma-2)
Type:
Enzyme
Mol. Mass.:
54087.63
Organism:
Rattus norvegicus (Rat)
Description:
P18508
Residue:
466
  
Component 2
Name:
Gamma-aminobutyric acid receptor subunit alpha-5
Synonyms:
GABA A Alpha5Beta2Gamma2 GABA A Alpha5m10Beta2Gamma2 GABA A Alpha5m9Beta2Gamma2 GABA A receptor alpha-5/beta-3/gamma-2 GBRA5_RAT Gabra5 | Gamma-aminobutyric acid receptor subunit alpha-5
Type:
Enzyme Catalytic Domain
Mol. Mass.:
52350.79
Organism:
RAT
Description:
GABA A alpha5 0 RAT::P19969
Residue:
464
  
Component 3
Name:
Gamma-aminobutyric acid receptor subunit beta-3
Synonyms:
GABA receptor beta-3 subunit Gabrb-3 | Gabrb3
Type:
PROTEIN
Mol. Mass.:
54180.66
Organism:
Rattus norvegicus
Description:
EBI_12481
Residue:
473
  
Inhibitor
Name:
BDBM50165329
Synonyms:
8-Chloro-2-(4-methoxy-phenyl)-5H-3,3a,5,9b-tetraaza-cyclopenta[a]naphthalene-1,4-dione | CHEMBL191088
Type:
Small organic molecule
Emp. Form.:
C16H11ClN4O3
Mol. Mass.:
342.737
SMILES:
COc1ccc(cc1)-c1nn2n(c3cc(Cl)ccc3[nH]c2=O)c1=O
: