Target
Cytochrome P450 2C9
Ligand
BDBM222178
Substrate
Meas. Tech.
ChEMBL_2204936 (CHEMBL5117644)
IC50
346±n/a nM
Citation
 Zhao, LMWang, SPannecouque, CDe Clercq, EPiao, HRChen, FE Discovery of novel biphenyl-substituted pyridone derivatives as potent non-nucleoside reverse transcriptase inhibitors with promising oral bioavailability. Eur J Med Chem 240:0 (2022) Target
Name:
Cytochrome P450 2C9
Synonyms:
(R)-limonene 6-monooxygenase CP2C9_HUMAN CYP2C9 Cytochrome P450 2C9 (CYP2C9 ) P-450MP P450 PB-1 | S-mephenytoin 4-hydroxylase
Type:
Enzyme
Mol. Mass.:
55636.33
Organism:
Homo sapiens (Human)
Description:
P11712
Residue:
490
  
Inhibitor
Name:
BDBM222178
Synonyms:
Rilpivirine
Type:
Small organic molecule
Emp. Form.:
C22H18N6
Mol. Mass.:
366.4185
SMILES:
Cc1cc(\C=C\C#N)cc(C)c1Nc1ccnc(Nc2ccc(cc2)C#N)n1
: