Target
5-hydroxytryptamine receptor 2B
Ligand
BDBM50592735
Substrate
Meas. Tech.
ChEMBL_2205180 (CHEMBL5117888)
Ki
0.390000±n/a nM
Citation
 Gjervig Jensen, KTornby Christoffersen, CGraulund Hvenegaard, MDidriksen, MJørgensen, M Distal kinetic deuterium isotope effect: Phenyl ring deuteration attenuates N-demethylation of Lu AF35700. Bioorg Med Chem Lett 72:0 (2022) Target
Name:
5-hydroxytryptamine receptor 2B
Synonyms:
5-HT-2B 5-hydroxytryptamine (serotonin) receptor 2B [Homo sapiens] 5-hydroxytryptamine receptor 2C (5HT2C) HTR2B Serotonin 2b (5-HT2b) receptor | Serotonin Receptor 2B
Type:
G Protein-Coupled Receptor (GPCR)
Mol. Mass.:
54312.47
Organism:
Homo sapiens (Human)
Description:
Receptor binding assays were performed using human clone stably expressed in CHO cells.
Residue:
481
  
Inhibitor
Name:
BDBM50592735
Synonyms:
CHEMBL5201983
Type:
Small organic molecule
Emp. Form.:
C21H25ClN2
Mol. Mass.:
345.92
SMILES:
[2H]c1c([2H])c([2H])c([C@@H]2C[C@@H](N3CCNC(C)(C)C3)c3cc(Cl)ccc23)c([2H])c1[2H]
: