Target
Alpha-1D adrenergic receptor
Ligand
BDBM50143664
Substrate
Meas. Tech.
ChEMBL_302653 (CHEMBL839942)
Ki
0.95±n/a nM
Citation
 Konkel, MJWetzel, JMCahir, MCraig, DANoble, SAGluchowski, C Synthesis and structure-activity relationship of fluoro analogues of 8-{2-[4-(4-methoxyphenyl)piperazin-1yl]ethyl}-8-azaspiro[4.5]decane-7,9-dione as selective alpha(1d)-adrenergic receptor antagonists. J Med Chem 48:3076-9 (2005)  
Target
Name:
Alpha-1D adrenergic receptor
Synonyms:
ADA1D_HUMAN ADRA1D Adrenergic receptor alpha Alpha 1D-adrenoreceptor Alpha-1D adrenoceptor adrenergic Alpha1D
Type:
Enzyme Catalytic Domain
Mol. Mass.:
60485.82
Organism:
Homo sapiens (Human)
Description:
adrenergic Alpha1D ADRA1D HUMAN::P25100
Residue:
572
  
Inhibitor
Name:
BDBM50143664
Synonyms:
8-{2-[4-(2,5-Difluoro-phenyl)-piperazin-1-yl]-ethyl}-8-aza-spiro[4.5]decane-7,9-dione | CHEMBL556313
Type:
Small organic molecule
Emp. Form.:
C21H27F2N3O2
Mol. Mass.:
391.4548
SMILES:
Fc1ccc(F)c(c1)N1CCN(CCN2C(=O)CC3(CCCC3)CC2=O)CC1
: