Target
Alpha-1A adrenergic receptor
Ligand
BDBM50143664
Substrate
Meas. Tech.
ChEMBL_302651 (CHEMBL876691)
Ki
1000±n/a nM
Citation
 Konkel, MJWetzel, JMCahir, MCraig, DANoble, SAGluchowski, C Synthesis and structure-activity relationship of fluoro analogues of 8-{2-[4-(4-methoxyphenyl)piperazin-1yl]ethyl}-8-azaspiro[4.5]decane-7,9-dione as selective alpha(1d)-adrenergic receptor antagonists. J Med Chem 48:3076-9 (2005)  
Target
Name:
Alpha-1A adrenergic receptor
Synonyms:
ADA1A_HUMAN ADRA1C Alpha 1A-adrenoceptor Alpha adrenergic receptor 1a Alpha-adrenergic receptor 1c adrenergic Alpha1 | adrenergic Alpha1C
Type:
Cell-surface receptors
Mol. Mass.:
51511.67
Organism:
Homo sapiens (Human)
Description:
P35348
Residue:
466
  
Inhibitor
Name:
BDBM50143664
Synonyms:
8-{2-[4-(2,5-Difluoro-phenyl)-piperazin-1-yl]-ethyl}-8-aza-spiro[4.5]decane-7,9-dione | CHEMBL556313
Type:
Small organic molecule
Emp. Form.:
C21H27F2N3O2
Mol. Mass.:
391.4548
SMILES:
Fc1ccc(F)c(c1)N1CCN(CCN2C(=O)CC3(CCCC3)CC2=O)CC1
: