Target
Carbonic anhydrase 1
Ligand
BDBM50165732
Substrate
Meas. Tech.
ChEMBL_302303 (CHEMBL875191)
Ki
7300±n/a nM
Citation
 Almajan, GLInnocenti, APuccetti, LManole, GBarbuceanu, SSaramet, IScozzafava, ASupuran, CT Carbonic anhydrase inhibitors. Inhibition of the cytosolic and tumor-associated carbonic anhydrase isozymes I, II, and IX with a series of 1,3,4-thiadiazole- and 1,2,4-triazole-thiols. Bioorg Med Chem Lett 15:2347-52 (2005)  
Target
Name:
Carbonic anhydrase 1
Synonyms:
CA-I CAB Carbonate dehydratase I Carbonic anhydrase 1 (CA I) Carbonic anhydrase 1 (Recombinant CA I) Carbonic anhydrase B Carbonic anhydrase I (CA I) Carbonic anhydrase I (CAI) Carbonic anhydrase isoenzyme I (hCA I) | hCA
Type:
Enzyme
Mol. Mass.:
28873.37
Organism:
Homo sapiens (Human)
Description:
P00915
Residue:
261
  
Inhibitor
Name:
BDBM50165732
Synonyms:
5-(4-Nitro-phenylsulfanylamino)-[1,3,4]thiadiazole-2-thiol | CHEMBL193436
Type:
Small organic molecule
Emp. Form.:
C8H6N4O2S3
Mol. Mass.:
286.354
SMILES:
[O-][N+](=O)c1ccc(SNc2n[n-]c(=[SH+])s2)cc1
: