Target
Carbonic anhydrase 2
Ligand
BDBM50165740
Substrate
Meas. Tech.
ChEMBL_302315 (CHEMBL840829)
Ki
9300.0±n/a nM
Citation
 Almajan, GLInnocenti, APuccetti, LManole, GBarbuceanu, SSaramet, IScozzafava, ASupuran, CT Carbonic anhydrase inhibitors. Inhibition of the cytosolic and tumor-associated carbonic anhydrase isozymes I, II, and IX with a series of 1,3,4-thiadiazole- and 1,2,4-triazole-thiols. Bioorg Med Chem Lett 15:2347-52 (2005)  
Target
Name:
Carbonic anhydrase 2
Synonyms:
CA-II CAC Carbonate dehydratase II Carbonic anhydrase 2 (CA-II) Carbonic anhydrase C Carbonic anhydrase II (CA-II) Carbonic anhydrase II (hCA II) | Carbonic anhydrase isoenzyme II (hCA II)
Type:
Enzyme
Mol. Mass.:
29250.71
Organism:
Homo sapiens (Human)
Description:
P00918
Residue:
260
  
Inhibitor
Name:
BDBM50165740
Synonyms:
3-(5-Mercapto-[1,3,4]thiadiazol-2-yl)-1,1-diphenyl-urea | CHEMBL440031
Type:
Small organic molecule
Emp. Form.:
C15H12N4OS2
Mol. Mass.:
328.412
SMILES:
Sc1nnc(NC(=O)N(c2ccccc2)c2ccccc2)s1
: