Target
Carbonic anhydrase 9
Ligand
BDBM50165741
Substrate
Meas. Tech.
ChEMBL_302319 (CHEMBL828907)
Ki
271000±n/a nM
Citation
 Almajan, GLInnocenti, APuccetti, LManole, GBarbuceanu, SSaramet, IScozzafava, ASupuran, CT Carbonic anhydrase inhibitors. Inhibition of the cytosolic and tumor-associated carbonic anhydrase isozymes I, II, and IX with a series of 1,3,4-thiadiazole- and 1,2,4-triazole-thiols. Bioorg Med Chem Lett 15:2347-52 (2005)  
Target
Name:
Carbonic anhydrase 9
Synonyms:
CA-IX CAH9_HUMAN Carbonic anhydrase 9 (CA IX) Carbonic anhydrase 9 precursor Carbonic anhydrase IX (CAIX) Carbonic anhydrases; II & IX MN RCC-associated antigen G250
Type:
Enzyme
Mol. Mass.:
49669.03
Organism:
Homo sapiens (Human)
Description:
Catalytic domain of human cloned isozyme was used in the assay
Residue:
459
  
Inhibitor
Name:
BDBM50165741
Synonyms:
1-(3,4-Dichloro-phenyl)-3-(5-mercapto-[1,3,4]thiadiazol-2-yl)-urea | CHEMBL365326
Type:
Small organic molecule
Emp. Form.:
C9H6Cl2N4OS2
Mol. Mass.:
321.206
SMILES:
Sc1nnc(NC(=O)Nc2ccc(Cl)c(Cl)c2)s1
: