Target
Carbonic anhydrase 9
Ligand
BDBM50165739
Substrate
Meas. Tech.
ChEMBL_302319 (CHEMBL828907)
Ki
11500±n/a nM
Citation
 Almajan, GLInnocenti, APuccetti, LManole, GBarbuceanu, SSaramet, IScozzafava, ASupuran, CT Carbonic anhydrase inhibitors. Inhibition of the cytosolic and tumor-associated carbonic anhydrase isozymes I, II, and IX with a series of 1,3,4-thiadiazole- and 1,2,4-triazole-thiols. Bioorg Med Chem Lett 15:2347-52 (2005)  
Target
Name:
Carbonic anhydrase 9
Synonyms:
CA-IX CAH9_HUMAN Carbonic anhydrase 9 (CA IX) Carbonic anhydrase 9 precursor Carbonic anhydrase IX (CAIX) Carbonic anhydrases; II & IX MN RCC-associated antigen G250
Type:
Enzyme
Mol. Mass.:
49669.03
Organism:
Homo sapiens (Human)
Description:
Catalytic domain of human cloned isozyme was used in the assay
Residue:
459
  
Inhibitor
Name:
BDBM50165739
Synonyms:
5-[4-(4-Bromo-benzenesulfonyl)-phenyl]-4-butyl-4H-[1,2,4]triazole-3-thiol | CHEMBL370105
Type:
Small organic molecule
Emp. Form.:
C18H18BrN3O2S2
Mol. Mass.:
452.388
SMILES:
CCCCn1c(n[nH]c1=S)-c1ccc(cc1)S(=O)(=O)c1ccc(Br)cc1
: