Target
N-lysine methyltransferase SMYD2
Ligand
BDBM50396022
Substrate
Meas. Tech.
ChEMBL_2205936 (CHEMBL5118644)
IC50
120±n/a nM
Citation
 Zheng, QZhang, WRao, GW Protein Lysine Methyltransferase SMYD2: A Promising Small Molecule Target for Cancer Therapy. J Med Chem 65:10119-10132 (2022) Target
Name:
N-lysine methyltransferase SMYD2
Synonyms:
HSKM-B KMT3C N-lysine methyltransferase SMYD2 SET and MYND domain-containing protein 2 (SMYD2) SMYD2_HUMAN
Type:
Enzyme
Mol. Mass.:
49689.57
Organism:
Homo sapiens (Human)
Description:
Q9NRG4
Residue:
433
  
Inhibitor
Name:
BDBM50396022
Synonyms:
CHEMBL2169920
Type:
Small organic molecule
Emp. Form.:
C29H38Cl2N4O4
Mol. Mass.:
577.542
SMILES:
Oc1ccc(CCNCCN(C2CCCCC2)C(=O)CCNCCc2ccc(Cl)c(Cl)c2)c2OCC(=O)Nc12
: