Target
D(1B) dopamine receptor
Ligand
BDBM50133928
Substrate
Meas. Tech.
ChEMBL_302994 (CHEMBL830233)
Ki
904±n/a nM
Citation
 Ding, KChen, JJi, MWu, XVarady, JYang, CYLu, YDeschamps, JRLevant, BWang, S Enantiomerically pure hexahydropyrazinoquinolines as potent and selective dopamine 3 subtype receptor ligands. J Med Chem 48:3171-81 (2005)  
Target
Name:
D(1B) dopamine receptor
Synonyms:
D(1B) dopamine receptor DRD5_RAT Dopamine D5 receptor Drd5
Type:
Enzyme Catalytic Domain
Mol. Mass.:
52827.88
Organism:
RAT
Description:
Dopamine D1B 0 RAT::P25115
Residue:
475
  
Inhibitor
Name:
BDBM50133928
Synonyms:
1-(4-Fluoro-phenyl)-4-(1,2,4,4a,5,6-hexahydro-pyrazino[1,2-a]quinolin-3-yl)-butan-1-one | CHEMBL341774
Type:
Small organic molecule
Emp. Form.:
C22H25FN2O
Mol. Mass.:
352.4451
SMILES:
Fc1ccc(cc1)C(=O)CCCN1CCN2C(CCc3ccccc23)C1
: