Target
Glutamate receptor 1
Ligand
BDBM50166286
Substrate
Meas. Tech.
ChEMBL_303109 (CHEMBL829619)
Ki
145±n/a nM
Citation
 Vogensen, SBClausen, RPGreenwood, JRJohansen, TNPickering, DSNielsen, BEbert, BKrogsgaard-Larsen, P Convergent synthesis and pharmacology of substituted tetrazolyl-2-amino-3-(3-hydroxy-5-methyl-4-isoxazolyl)propionic acid analogues. J Med Chem 48:3438-42 (2005)  
Target
Name:
Glutamate receptor 1
Synonyms:
AMPA-selective glutamate receptor 1 GLUR1 GRIA1_HUMAN GluR-A Glutamate AMPA 1 Glutamate receptor AMPA 1/2 Glutamate receptor ionotropic, AMPA 1
Type:
Enzyme Catalytic Domain
Mol. Mass.:
101512.92
Organism:
Homo sapiens (Human)
Description:
Glutamate AMPA 1 GRIA1 HUMAN::P42261
Residue:
906
  
Inhibitor
Name:
BDBM50166286
Synonyms:
(RS)-2-amino-3-[3-hydroxy-5-(2-ethyl-2H-5-tetrazolyl)-4-isoxazolyl]propionic acid 2-amino-3-(5-(2-ethyl-2H-tetrazol-5-yl)-3-hydroxyisoxazol-4-yl)propanoic acid | CHEMBL370941
Type:
Small organic molecule
Emp. Form.:
C9H12N6O4
Mol. Mass.:
268.2294
SMILES:
CCn1nnc(n1)-c1o[nH]c(=O)c1CC(N)C(O)=O
: