Target
Glutamate receptor ionotropic, kainate 3
Ligand
BDBM50166288
Substrate
Meas. Tech.
ChEMBL_310490 (CHEMBL834064)
EC50
110±n/a nM
Citation
 Vogensen, SBClausen, RPGreenwood, JRJohansen, TNPickering, DSNielsen, BEbert, BKrogsgaard-Larsen, P Convergent synthesis and pharmacology of substituted tetrazolyl-2-amino-3-(3-hydroxy-5-methyl-4-isoxazolyl)propionic acid analogues. J Med Chem 48:3438-42 (2005)  
Target
Name:
Glutamate receptor ionotropic, kainate 3
Synonyms:
GRIK3_RAT Glutamate receptor ionotropic kainate 3 Grik3
Type:
PROTEIN
Mol. Mass.:
104080.46
Organism:
Rattus norvegicus
Description:
ChEMBL_1447329
Residue:
919
  
Inhibitor
Name:
BDBM50166288
Synonyms:
(S)-2-Amino-3-[3-hydroxy-5-(2-methyl-2H-tetrazol-5-yl)-isoxazol-4-yl]-propionic acid CHEMBL370038
Type:
Small organic molecule
Emp. Form.:
C8H10N6O4
Mol. Mass.:
254.2028
SMILES:
Cn1nnc(n1)-c1o[nH]c(=O)c1C[C@H](N)C(O)=O
: