Target
Glutamate receptor ionotropic, kainate 2
Ligand
BDBM50166288
Substrate
Meas. Tech.
ChEMBL_303150 (CHEMBL829124)
Ki
18800±n/a nM
Citation
 Vogensen, SBClausen, RPGreenwood, JRJohansen, TNPickering, DSNielsen, BEbert, BKrogsgaard-Larsen, P Convergent synthesis and pharmacology of substituted tetrazolyl-2-amino-3-(3-hydroxy-5-methyl-4-isoxazolyl)propionic acid analogues. J Med Chem 48:3438-42 (2005)  
Target
Name:
Glutamate receptor ionotropic, kainate 2
Synonyms:
EAA4 GLUR6 GRIK2_HUMAN GluR-6 Glutamate receptor 6 Glutamate receptor, ionotropic kainate 2 Glutamate-Kainate, GluR6
Type:
Enzyme Catalytic Domain
Mol. Mass.:
102592.78
Organism:
Homo sapiens (Human)
Description:
Q13002
Residue:
908
  
Inhibitor
Name:
BDBM50166288
Synonyms:
(S)-2-Amino-3-[3-hydroxy-5-(2-methyl-2H-tetrazol-5-yl)-isoxazol-4-yl]-propionic acid CHEMBL370038
Type:
Small organic molecule
Emp. Form.:
C8H10N6O4
Mol. Mass.:
254.2028
SMILES:
Cn1nnc(n1)-c1o[nH]c(=O)c1C[C@H](N)C(O)=O
: