Target
Glutamate receptor 4
Ligand
BDBM50166285
Substrate
Meas. Tech.
ChEMBL_303112 (CHEMBL829621)
Ki
732.0±n/a nM
Citation
 Vogensen, SBClausen, RPGreenwood, JRJohansen, TNPickering, DSNielsen, BEbert, BKrogsgaard-Larsen, P Convergent synthesis and pharmacology of substituted tetrazolyl-2-amino-3-(3-hydroxy-5-methyl-4-isoxazolyl)propionic acid analogues. J Med Chem 48:3438-42 (2005)  
Target
Name:
Glutamate receptor 4
Synonyms:
GLUR4 GRIA4_HUMAN Glutamate receptor ionotropic AMPA | Glutamate receptor ionotropic, AMPA 4
Type:
PROTEIN
Mol. Mass.:
100881.87
Organism:
Homo sapiens (Human)
Description:
ChEMBL_468628
Residue:
902
  
Inhibitor
Name:
BDBM50166285
Synonyms:
(RS)-2-amino-3-[3-hydroxy-5-(2-propyl-2H-5-tetrazolyl)-4-isoxazolyl]propionic acid 2-amino-3-(3-hydroxy-5-(2-propyl-2H-tetrazol-5-yl)isoxazol-4-yl)propanoic acid | CHEMBL372643
Type:
Small organic molecule
Emp. Form.:
C10H14N6O4
Mol. Mass.:
282.256
SMILES:
CCCn1nnc(n1)-c1o[nH]c(=O)c1CC(N)C(O)=O
: