Target
Alpha-2A adrenergic receptor
Ligand
BDBM50166563
Substrate
Meas. Tech.
ChEMBL_306656 (CHEMBL831429)
IC50
47±n/a nM
Citation
 Kanuma, KOmodera, KNishiguchi, MFunakoshi, TChaki, SSemple, GTran, TAKramer, BHsu, DCasper, MThomsen, BBeeley, NSekiguchi, Y Discovery of 4-(dimethylamino)quinazolines as potent and selective antagonists for the melanin-concentrating hormone receptor 1. Bioorg Med Chem Lett 15:2565-9 (2005)  
Target
Name:
Alpha-2A adrenergic receptor
Synonyms:
ADA2A_HUMAN ADRA2R Adrenergic alpha2A Alpha-2 adrenergic receptor subtype C10 Alpha-2A adrenoreceptor alpha-2A adrenergic receptor [Homo sapiens]
Type:
Enzyme
Mol. Mass.:
48979.91
Organism:
Homo sapiens (Human)
Description:
P08913
Residue:
465
  
Inhibitor
Name:
BDBM50166563
Synonyms:
4-Bromo-N-[4-(4-dimethylamino-quinazolin-2-ylamino)-cyclohexyl]-2-trifluoromethoxy-benzenesulfonamide | CHEMBL193771
Type:
Small organic molecule
Emp. Form.:
C23H25BrF3N5O3S
Mol. Mass.:
588.441
SMILES:
CN(C)c1nc(NC2CCC(CC2)NS(=O)(=O)c2ccc(Br)cc2OC(F)(F)F)nc2ccccc12
: